Reaction Details
TargetKallikrein-1
LigandBDBM357150
Substrate/Competitorn/a
Meas. Tech.Kallikrein Assay
Ki 0.770±n/a nM
Citation Xu, JAli, AZhou, WGao, YEdmondson, SDMertz, ENeelamkavil, SFLiu, WSun, WShen, DHarper, BZhu, CBara, TLim, YYang, M Factor XIA inhibitors US Patent US10214512 Publication Date 2/26/2019
 
Kallikrein-1
Name:Kallikrein-1
Type:Enzyme
Mol. Mass.:28874.69
Organism:Homo sapiens (Human)
Description:P06870
Residue:262
BDBM357150
NameBDBM357150
Synonyms:(Z)-5-(3-chloro-2,6-difluorophenyl)-2-(24-((ethoxycarbonyl)amino)-4-oxo-11H-3-aza-1(4,2)-imidazola-2(1,2)-benzenacyclononaphane-9-yl)pyridine 1-oxide | US10214512, Example 109-a
TypeSmall organic molecule
Emp. Form.C29H26ClF2N5O4
Mol. Mass.581.998
SMILESCCOC(=O)Nc1ccc2-c3c[nH]c(n3)C(CCCCC(=O)Nc2c1)c1ccc(c[n+]1[O-])-c1c(F)ccc(Cl)c1F