Reaction Details
TargetKallikrein-1
LigandBDBM357167
Substrate/Competitorn/a
Meas. Tech.Kallikrein Assay
Ki 1.41±n/a nM
Citation Xu, JAli, AZhou, WGao, YEdmondson, SDMertz, ENeelamkavil, SFLiu, WSun, WShen, DHarper, BZhu, CBara, TLim, YYang, M Factor XIA inhibitors US Patent US10214512 Publication Date 2/26/2019
 
Kallikrein-1
Name:Kallikrein-1
Type:Enzyme
Mol. Mass.:28874.69
Organism:Homo sapiens (Human)
Description:P06870
Residue:262
BDBM357167
NameBDBM357167
Synonyms:US10214512, Example 123
TypeSmall organic molecule
Emp. Form.C30H26ClF4N5O4
Mol. Mass.632.005
SMILESCOC(=O)Nc1ccc2-c3nc([nH]c3C)[C@H](CCCCC(=O)Nc2c1)c1ccc(c[n+]1[O-])-c1c(F)c(Cl)ccc1C(F)(F)F