Reaction Details
TargetKallikrein-1
LigandBDBM357206
Substrate/Competitorn/a
Meas. Tech.Kallikrein Assay
Ki 0.510±n/a nM
Citation Xu, JAli, AZhou, WGao, YEdmondson, SDMertz, ENeelamkavil, SFLiu, WSun, WShen, DHarper, BZhu, CBara, TLim, YYang, M Factor XIA inhibitors US Patent US10214512 Publication Date 2/26/2019
 
Kallikrein-1
Name:Kallikrein-1
Type:Enzyme
Mol. Mass.:28874.69
Organism:Homo sapiens (Human)
Description:P06870
Residue:262
BDBM357206
NameBDBM357206
Synonyms:US10214512, Example 150-a
TypeSmall organic molecule
Emp. Form.C31H29F4N5O5
Mol. Mass.627.5861
SMILESCOC(=O)Nc1ccc2-c3nc([nH]c3C)[C@H](CCC[C@@H](C)C(=O)Nc2c1)c1ccc(c[n+]1[O-])-c1c(OC(F)F)ccc(F)c1F