Reaction Details
TargetFibroblast growth factor receptor 1
LigandBDBM357247
Substrate/Competitorn/a
Meas. Tech.Determination of the Effects of the Compounds of the Present Invention on FGFR Kinase Activity
IC50 75.3±n/a nM
Citation Chen, LGuan, DBai, HYan, XMiao, SZhu, S Substituted pyrazoles as inhibitors of fibroblast growth factor receptor US Patent US10214515 Publication Date 2/26/2019
 
Fibroblast growth factor receptor 1
Name:Fibroblast growth factor receptor 1
Type:Receptor
Mol. Mass.:91861.70
Organism:Homo sapiens (Human)
Description:P11362
Residue:822
BDBM357247
NameBDBM357247
Synonyms:Methyl 5-(5-amino-4-(1H-indole-2-carbonyl)-1H-pyrazol-1-yl)-1H-benzo[d]imidazole-2-carboxylate | US10214515, Example 7
TypeSmall organic molecule
Emp. Form.C21H16N6O3
Mol. Mass.400.3901
SMILESCOC(=O)c1nc2cc(ccc2[nH]1)-n1ncc(C(=O)c2cc3ccccc3[nH]2)c1N