Reaction Details
TargetFibroblast growth factor receptor 2
LigandBDBM357250
Substrate/Competitorn/a
Meas. Tech.Determination of the Effects of the Compounds of the Present Invention on FGFR Kinase Activity
IC50 5.00±n/a nM
Citation Chen, LGuan, DBai, HYan, XMiao, SZhu, S Substituted pyrazoles as inhibitors of fibroblast growth factor receptor US Patent US10214515 Publication Date 2/26/2019
 
Fibroblast growth factor receptor 2
Name:Fibroblast growth factor receptor 2
Type:Enzyme
Mol. Mass.:92015.45
Organism:Homo sapiens (Human)
Description:P21802
Residue:821
BDBM357250
NameBDBM357250
Synonyms:(5-Amino-1-(2-cyclopropyl-1H-benzo[d]imidazol-5-yl)-1H-pyrazol-4-yl)(6-fluoro-1H-indol-2-yl)methanone | US10214515, Example 12
TypeSmall organic molecule
Emp. Form.C22H17FN6O
Mol. Mass.400.4084
SMILESNc1c(cnn1-c1ccc2[nH]c(nc2c1)C1CC1)C(=O)c1cc2ccc(F)cc2[nH]1