Reaction Details
TargetFibroblast growth factor receptor 4
LigandBDBM357251
Substrate/Competitorn/a
Meas. Tech.Determination of the Effects of the Compounds of the Present Invention on FGFR Kinase Activity
IC50 1738±n/a nM
Citation Chen, LGuan, DBai, HYan, XMiao, SZhu, S Substituted pyrazoles as inhibitors of fibroblast growth factor receptor US Patent US10214515 Publication Date 2/26/2019
 
Fibroblast growth factor receptor 4
Name:Fibroblast growth factor receptor 4
Type:Protein
Mol. Mass.:87957.45
Organism:Homo sapiens (Human)
Description:P22455
Residue:802
BDBM357251
NameBDBM357251
Synonyms:(5-Amino-1-(2-cyclopropyl-1H-benzo[d]imidazol-5-yl)-1H-pyrazol-4-yl)(6-bromo-1H-indol-2-yl)methanone | US10214515, Example 13
TypeSmall organic molecule
Emp. Form.C22H17BrN6O
Mol. Mass.461.314
SMILESNc1c(cnn1-c1ccc2[nH]c(nc2c1)C1CC1)C(=O)c1cc2ccc(Br)cc2[nH]1