Reaction Details
TargetFibroblast growth factor receptor 2
LigandBDBM357254
Substrate/Competitorn/a
Meas. Tech.Determination of the Effects of the Compounds of the Present Invention on FGFR Kinase Activity
IC50 5.00±n/a nM
Citation Chen, LGuan, DBai, HYan, XMiao, SZhu, S Substituted pyrazoles as inhibitors of fibroblast growth factor receptor US Patent US10214515 Publication Date 2/26/2019
 
Fibroblast growth factor receptor 2
Name:Fibroblast growth factor receptor 2
Type:Enzyme
Mol. Mass.:92015.45
Organism:Homo sapiens (Human)
Description:P21802
Residue:821
BDBM357254
NameBDBM357254
Synonyms:2-(5-Amino-1-(2-cyclopropyl-1H-benzo[d]imidazol-5-yl)-1H-pyrazole-4-carbonyl)-1H-indole-6-carbonitrile | US10214515, Example 17
TypeSmall organic molecule
Emp. Form.C23H17N7O
Mol. Mass.407.4274
SMILESNc1c(cnn1-c1ccc2[nH]c(nc2c1)C1CC1)C(=O)c1cc2ccc(cc2[nH]1)C#N