Reaction Details
TargetDual specificity protein kinase TTK
LigandBDBM228282
Substrate/Competitorn/a
Meas. Tech.Mps-1 Kinase Assay
pH7.7±n/a
IC50<1.000±n/a nM
Commentsextracted
Citation Schulze, VKosemund, DSchirok, HBader, BLienau, PWengner, AMBriem, HHolton, SSiemeister, GPrechtl, SKoppitz, MStöckigt, DPrien, O Substituted triazolopyridines US Patent US9555022 Publication Date 1/31/2017
 
Dual specificity protein kinase TTK
Name:Dual specificity protein kinase TTK
Type:Protein
Mol. Mass.:97086.79
Organism:Homo sapiens (Human)
Description:P33981
Residue:857
BDBM228282
NameBDBM228282
Synonyms:US9555022, Example 02.19
TypeSmall organic molecule
Emp. Form.C31H27FN6O4
Mol. Mass.566.5823
SMILESCOc1cc(ccc1Nc1nc2ccc(cn2n1)-c1ccc(NC(=O)Cc2ccc(F)cc2)cc1)C(=O)N1CC(O)C1