Reaction Details
TargetMajor prion protein
LigandBDBM357270
Substrate/Competitorn/a
Meas. Tech.Human Platelet Aggregation Inhibition Test
IC50 28.0±n/a nM
Citation Tran, TIbarra, JBShin, YUllman, BZou, NZeng, X Pyrazolyl substituted carbonic acid derivatives as modulators of the prostacyclin (PGI2) receptor useful for the treatment of disorders related thereto US Patent US10214518 Publication Date 2/26/2019
 
Major prion protein
Name:Major prion protein
Type:PROTEIN
Mol. Mass.:27671.97
Organism:Homo sapiens (Human)
Description:ChEMBL_158887
Residue:253
BDBM357270
NameBDBM357270
Synonyms:2-(((1s,4s)-4-((5- (methylthio)-4-(5- methylthiophen-2-yl)-3- phenyl-1H-pyrazol-1- yl)methyl)cyclohexyl) methoxy)acetic acid US11098034, Compound 111
TypeSmall organic molecule
Emp. Form.C25H30N2O3S2
Mol. Mass.470.647
SMILESCSc1c(-c2ccc(C)s2)c(nn1C[C@@H]1CC[C@H](COCC(O)=O)CC1)-c1ccccc1