Reaction Details
TargetDihydrofolate reductase
LigandBDBM18046
Substrate/CompetitorBDBM18044
Meas. Tech.Enzyme Inhibition Assay
pH7±n/a
Temperature303.15±n/a K
IC50 940±n/a nM
Citation Whitlow, MHoward, AJStewart, DHardman, KDChan, JHBaccanari, DPTansik, RLHong, JSKuyper, LF X-Ray crystal structures of Candida albicans dihydrofolate reductase: high resolution ternary complexes in which the dihydronicotinamide moiety of NADPH is displaced by an inhibitor. J Med Chem44:2928-32 (2001) 
 
Dihydrofolate reductase
Name:Dihydrofolate reductase
Type:Enzyme
Mol. Mass.:21453.99
Organism:Homo sapiens (Human)
Description:Recombinant human DHFR.
Residue:187
BDBM18046
BDBM18044
NameBDBM18046
Synonyms:5-((4-methylphenyl)thio)-quinazoline 2,4-diamine, 1 5-[(4-methylphenyl)sulfanyl]quinazoline-2,4-diamine CHEMBL83547 | GW578
TypeSmall organic molecule
Emp. Form.C15H14N4S
Mol. Mass.282.363
SMILESCc1ccc(Sc2cccc3nc(N)nc(N)c23)cc1