Reaction Details
TargetAndrogen receptor
LigandBDBM18201
Substrate/CompetitorBDBM18161
Meas. Tech.AR Transcriptional Activation Assay and MDA Whole-Cell Binding Assay
pH7.4±n/a
Temperature310.15±n/a K
Ki 15±5 nM
EC50 8.9±2.7 nM
Commentsefficacy=104 +/- 10 %.
Citation Higuchi, RIArienti, KLLópez, FJMani, NSMais, DECaferro, TRLong, YOJones, TKEdwards, JPZhi, LSchrader, WTNegro-Vilar, AMarschke, KB Novel series of potent, nonsteroidal, selective androgen receptor modulators based on 7H-[1,4]oxazino[3,2-g]quinolin-7-ones. J Med Chem50:2486-96 (2007) 
 
Androgen receptor
Name:Androgen receptor
Type:Receptor
Mol. Mass.:99185.27
Organism:Homo sapiens (Human)
Description:CHO cells were stably transfected with human AR gene.
Residue:920
BDBM18201
BDBM18161
NameBDBM18201
Synonyms:3-methyl-1-(2,2,2-trifluoroethyl)-9-(trifluoromethyl)-1H,2H,3H,6H,7H-quinolino[7,6-b][1,4]oxazin-7-one | 7H-[1,4]Oxazino[3,2-g]quinolin-7-one based compound, 10h
TypeSmall organic molecule
Emp. Form.C15H12F6N2O2
Mol. Mass.366.2584
SMILESCC1CN(CC(F)(F)F)c2cc3c(cc(=O)[nH]c3cc2O1)C(F)(F)F