Reaction Details
TargetAndrogen receptor
LigandBDBM18211
Substrate/CompetitorBDBM18161
Meas. Tech.AR Transcriptional Activation Assay and MDA Whole-Cell Binding Assay
Ki 4.0±n/a nM
EC50 1.9±n/a nM
Citation Higuchi, RIArienti, KLLópez, FJMani, NSMais, DECaferro, TRLong, YOJones, TKEdwards, JPZhi, LSchrader, WTNegro-Vilar, AMarschke, KB Novel series of potent, nonsteroidal, selective androgen receptor modulators based on 7H-[1,4]oxazino[3,2-g]quinolin-7-ones. J Med Chem50:2486-96 (2007) 
 
Androgen receptor
Name:Androgen receptor
Type:Receptor
Mol. Mass.:99185.27
Organism:Homo sapiens (Human)
Description:CHO cells were stably transfected with human AR gene.
Residue:920
BDBM18211
BDBM18161
NameBDBM18211
Synonyms:1-(cyclopropylmethyl)-2-methyl-9-(trifluoromethyl)-1H,2H,3H,6H,7H-quinolino[7,6-b][1,4]oxazin-7-one | 7H-[1,4]Oxazino[3,2-g]quinolin-7-one based compound, 16c
TypeSmall organic molecule
Emp. Form.C17H17F3N2O2
Mol. Mass.338.3243
SMILESCC1COc2cc3[nH]c(=O)cc(c3cc2N1CC1CC1)C(F)(F)F