Reaction Details
TargetBeta-secretase 1
LigandBDBM228466
Substrate/Competitorn/a
Meas. Tech.In Vivo Inhibition of Beta-Secretase
IC50 1.89±n/a nM
Citation Lewis, RTAllen, JRCheng, YChoquette, DEpstein, OGuzman-Perez, AHarrington, PEHua, ZHungate, RWHuman, JBJudd, TLiu, QLopez, PMinatti, AEOlivieri, PRomero, KRumfelt, SRzasa, RMSchenkel, LStellwagen, JWhite, RXue, QZheng, XMZhong, W Amino-dihydrothiazine and amino-dioxido dihydrothiazine compounds as beta-secretase antagonists and methods of use US Patent US9556135 Publication Date 1/31/2017
 
Beta-secretase 1
Name:Beta-secretase 1
Type:Protein
Mol. Mass.:55755.10
Organism:Homo sapiens (Human)
Description:P56817
Residue:501
BDBM228466
NameBDBM228466
Synonyms:US9556135, 117
TypeSmall organic molecule
Emp. Form.C23H21FN6O2S
Mol. Mass.464.515
SMILESC[C@]1(CS(=O)(=O)C2(CCC2)C(N)=N1)c1cc(Nc2nccc3cc(cnc23)[N+]#[C-])ccc1F