Reaction Details
TargetBeta-secretase 1
LigandBDBM229056
Substrate/Competitorn/a
Meas. Tech.In Vivo Inhibition of Beta-Secretase
IC50 0.760±n/a nM
Citation Lewis, RTAllen, JRCheng, YChoquette, DEpstein, OGuzman-Perez, AHarrington, PEHua, ZHungate, RWHuman, JBJudd, TLiu, QLopez, PMinatti, AEOlivieri, PRomero, KRumfelt, SRzasa, RMSchenkel, LStellwagen, JWhite, RXue, QZheng, XMZhong, W Amino-dihydrothiazine and amino-dioxido dihydrothiazine compounds as beta-secretase antagonists and methods of use US Patent US9556135 Publication Date 1/31/2017
 
Beta-secretase 1
Name:Beta-secretase 1
Type:Protein
Mol. Mass.:55755.10
Organism:Homo sapiens (Human)
Description:P56817
Residue:501
BDBM229056
NameBDBM229056
Synonyms:US9556135, 122
TypeSmall organic molecule
Emp. Form.C22H22FN5O3S
Mol. Mass.455.505
SMILESCc1cc(cnc1C(=O)Nc1ccc(F)c(c1)[C@]1(C)CS(=O)(=O)C2(CCC2)C(N)=N1)C#N