Reaction Details
TargetBeta-secretase 1
LigandBDBM229992
Substrate/Competitorn/a
Meas. Tech.In Vivo Inhibition of Beta-Secretase
IC50 0.550±n/a nM
Citation Lewis, RTAllen, JRCheng, YChoquette, DEpstein, OGuzman-Perez, AHarrington, PEHua, ZHungate, RWHuman, JBJudd, TLiu, QLopez, PMinatti, AEOlivieri, PRomero, KRumfelt, SRzasa, RMSchenkel, LStellwagen, JWhite, RXue, QZheng, XMZhong, W Amino-dihydrothiazine and amino-dioxido dihydrothiazine compounds as beta-secretase antagonists and methods of use US Patent US9556135 Publication Date 1/31/2017
 
Beta-secretase 1
Name:Beta-secretase 1
Type:Protein
Mol. Mass.:55755.10
Organism:Homo sapiens (Human)
Description:P56817
Residue:501
BDBM229992
NameBDBM229992
Synonyms:US9556135, 159
TypeSmall organic molecule
Emp. Form.C22H22F3N5O3S
Mol. Mass.493.502
SMILESCOc1cnc2c(Nc3ccc(F)c(c3)[C@]3(CF)CS(=O)(=O)C(C)(C)C(N)=N3)ncc(F)c2c1