Reaction Details
TargetBeta-secretase 1
LigandBDBM229994
Substrate/Competitorn/a
Meas. Tech.In Vivo Inhibition of Beta-Secretase
IC50 1.54±n/a nM
Citation Lewis, RTAllen, JRCheng, YChoquette, DEpstein, OGuzman-Perez, AHarrington, PEHua, ZHungate, RWHuman, JBJudd, TLiu, QLopez, PMinatti, AEOlivieri, PRomero, KRumfelt, SRzasa, RMSchenkel, LStellwagen, JWhite, RXue, QZheng, XMZhong, W Amino-dihydrothiazine and amino-dioxido dihydrothiazine compounds as beta-secretase antagonists and methods of use US Patent US9556135 Publication Date 1/31/2017
 
Beta-secretase 1
Name:Beta-secretase 1
Type:Protein
Mol. Mass.:55755.10
Organism:Homo sapiens (Human)
Description:P56817
Residue:501
BDBM229994
NameBDBM229994
Synonyms:US9556135, 104
TypeSmall organic molecule
Emp. Form.C24H27FN6O3S
Mol. Mass.498.573
SMILESCC1(C)C(N)=N[C@@](C)(CS1(=O)=O)c1cc(Nc2ncnc3cc(OCC4CC4)cnc23)ccc1F