Reaction Details
TargetCathepsin D
LigandBDBM230011
Substrate/Competitorn/a
Meas. Tech.In Vitro Enzymatic
pH3.5±n/a
IC50 32100±n/a nM
Commentsextracted
Citation Lewis, RTAllen, JRCheng, YChoquette, DEpstein, OGuzman-Perez, AHarrington, PEHua, ZHungate, RWHuman, JBJudd, TLiu, QLopez, PMinatti, AEOlivieri, PRomero, KRumfelt, SRzasa, RMSchenkel, LStellwagen, JWhite, RXue, QZheng, XMZhong, W Amino-dihydrothiazine and amino-dioxido dihydrothiazine compounds as beta-secretase antagonists and methods of use US Patent US9556135 Publication Date 1/31/2017
 
Cathepsin D
Name:Cathepsin D
Type:Enzyme
Mol. Mass.:44551.72
Organism:Homo sapiens (Human)
Description:Human proCathepsin D (SwissProt accession number P07339) was expressed in Sf9 cells, purified, and autoactivated.
Residue:412
BDBM230011
NameBDBM230011
Synonyms:US9556135, 178
TypeSmall organic molecule
Emp. Form.C20H17ClF3N5O2S
Mol. Mass.483.894
SMILESC[C@]1(CS(=O)(=O)[C@@](C)(F)C(N)=N1)c1cc(Nc2ncc(F)c3cc(Cl)cnc23)ccc1F