Reaction Details
TargetBeta-secretase 1
LigandBDBM230013
Substrate/Competitorn/a
Meas. Tech.In Vivo Inhibition of Beta-Secretase
IC50 1.90±n/a nM
Citation Lewis, RTAllen, JRCheng, YChoquette, DEpstein, OGuzman-Perez, AHarrington, PEHua, ZHungate, RWHuman, JBJudd, TLiu, QLopez, PMinatti, AEOlivieri, PRomero, KRumfelt, SRzasa, RMSchenkel, LStellwagen, JWhite, RXue, QZheng, XMZhong, W Amino-dihydrothiazine and amino-dioxido dihydrothiazine compounds as beta-secretase antagonists and methods of use US Patent US9556135 Publication Date 1/31/2017
 
Beta-secretase 1
Name:Beta-secretase 1
Type:Protein
Mol. Mass.:55755.10
Organism:Homo sapiens (Human)
Description:P56817
Residue:501
BDBM230013
NameBDBM230013
Synonyms:US9556135, 199
TypeSmall organic molecule
Emp. Form.C19H18ClFN4O3S
Mol. Mass.436.888
SMILESC[C@]1(CS(=O)(=O)C2(CC2)C(N)=N1)c1cc(NC(=O)c2ccc(Cl)cn2)ccc1F