Reaction Details
TargetBeta-secretase 1
LigandBDBM230018
Substrate/Competitorn/a
Meas. Tech.In Vivo Inhibition of Beta-Secretase
IC50 0.620±n/a nM
Citation Lewis, RTAllen, JRCheng, YChoquette, DEpstein, OGuzman-Perez, AHarrington, PEHua, ZHungate, RWHuman, JBJudd, TLiu, QLopez, PMinatti, AEOlivieri, PRomero, KRumfelt, SRzasa, RMSchenkel, LStellwagen, JWhite, RXue, QZheng, XMZhong, W Amino-dihydrothiazine and amino-dioxido dihydrothiazine compounds as beta-secretase antagonists and methods of use US Patent US9556135 Publication Date 1/31/2017
 
Beta-secretase 1
Name:Beta-secretase 1
Type:Protein
Mol. Mass.:55755.10
Organism:Homo sapiens (Human)
Description:P56817
Residue:501
BDBM230018
NameBDBM230018
Synonyms:US9556135, 201
TypeSmall organic molecule
Emp. Form.C19H17ClF2N4O3S
Mol. Mass.454.878
SMILESC[C@@]1(N=C(N)C2(CC2)S(=O)(=O)[C@H]1F)c1cc(NC(=O)c2ccc(Cl)cn2)ccc1F