Reaction Details
TargetDihydrofolate reductase
LigandBDBM18229
Substrate/CompetitorBDBM18044
Meas. Tech.Determination of IC50
pH7.4±n/a
Temperature310.15±n/a K
IC50 0.097±n/a nM
Citation Chan, DCFu, HForsch, RAQueener, SFRosowsky, A Design, synthesis, and antifolate activity of new analogues of piritrexim and other diaminopyrimidine dihydrofolate reductase inhibitors with omega-carboxyalkoxy or omega-carboxy-1-alkynyl substitution in the side chain. J Med Chem48:4420-31 (2005) 
 
Dihydrofolate reductase
Name:Dihydrofolate reductase
Type:Enzyme
Mol. Mass.:23891.29
Organism:Pneumocystis carinii
Description:n/a
Residue:206
BDBM18229
BDBM18044
NameBDBM18229
Synonyms:5-[3-({2,4-diamino-5-methylpyrido[2,3-d]pyrimidin-6-yl}methyl)-4-methoxyphenyl]pent-4-ynoic acid | Piritrexim analogue, 10
TypeSmall organic molecule
Emp. Form.C21H21N5O3
Mol. Mass.391.4231
SMILESCOc1ccc(cc1Cc1cnc2nc(N)nc(N)c2c1C)C#CCCC(O)=O