Reaction Details
TargetSerine/threonine-protein kinase TBK1
LigandBDBM357915
Substrate/Competitorn/a
Meas. Tech.Kinase Assays
IC50 80.0±n/a nM
Citation Showalter, HDSaltiel, ARTesmer, JJGan, X Amlexanox analogs US Patent US10214536 Publication Date 2/26/2019
 
Serine/threonine-protein kinase TBK1
Name:Serine/threonine-protein kinase TBK1
Type:protein
Mol. Mass.:83645.20
Organism:Homo sapiens (Human)
Description:Q9UHD2
Residue:729
BDBM357915
NameBDBM357915
Synonyms:(E)-2-(((Dimethylamino)methylene)amino)-7-isopropyl-5-oxo-5H-chromeno[2,3-b]pyridine-3-carboxylic acid | US10214536, Compound 275
TypeSmall organic molecule
Emp. Form.C19H19N3O4
Mol. Mass.353.3719
SMILESCC(C)c1ccc2oc3nc(\N=C\N(C)C)c(cc3c(=O)c2c1)C(O)=O