Reaction Details
TargetAndrogen receptor
LigandBDBM18672
Substrate/CompetitorBDBM26258
Meas. Tech.Competitive Radioligand Displacement Assay
pH7.4±n/a
Temperature277.15±n/a K
Ki 13.69±0.68 nM
CommentsCompound nM stimulates transcription to 17.4 % of that observed with 1 nM DHT.
Citation Marhefka, CAGao, WChung, KKim, JHe, YYin, DBohl, CDalton, JTMiller, DD Design, synthesis, and biological characterization of metabolically stable selective androgen receptor modulators. J Med Chem47:993-8 (2004) 
 
Androgen receptor
Name:Androgen receptor
Type:Enzyme
Mol. Mass.:98219.08
Organism:Rattus norvegicus (Rat)
Description:P15207
Residue:902
BDBM18672
BDBM26258
NameBDBM18672
Synonyms:(2S)-2-hydroxy-3-(4-methoxyphenoxy)-2-methyl-N-[4-nitro-3-(trifluoromethyl)phenyl]propanamide | Nonsteroidal AR Ligand, S-13
TypeSmall organic molecule
Emp. Form.C18H17F3N2O6
Mol. Mass.414.3326
SMILESCOc1ccc(OC[C@](C)(O)C(=O)Nc2ccc(c(c2)C(F)(F)F)[N+]([O-])=O)cc1