Reaction Details
TargetAndrogen receptor
LigandBDBM18674
Substrate/CompetitorBDBM26258
Meas. Tech.Competitive Radioligand Displacement Assay
pH7.4±n/a
Temperature277.15±n/a K
Ki 16.97±0.64 nM
CommentsCompound nM stimulates transcription to 12.43 % of that observed with 1 nM DHT.
Citation Marhefka, CAGao, WChung, KKim, JHe, YYin, DBohl, CDalton, JTMiller, DD Design, synthesis, and biological characterization of metabolically stable selective androgen receptor modulators. J Med Chem47:993-8 (2004) 
 
Androgen receptor
Name:Androgen receptor
Type:Enzyme
Mol. Mass.:98219.08
Organism:Rattus norvegicus (Rat)
Description:P15207
Residue:902
BDBM18674
BDBM26258
NameBDBM18674
Synonyms:(2S)-2-hydroxy-3-[4-(1H-indol-5-yl)phenoxy]-2-methyl-N-[4-nitro-3-(trifluoromethyl)phenyl]propanamide | Nonsteroidal AR Ligand, S-15
TypeSmall organic molecule
Emp. Form.C25H20F3N3O5
Mol. Mass.499.4386
SMILESC[C@](O)(COc1ccc(cc1)-c1ccc2[nH]ccc2c1)C(=O)Nc1ccc(c(c1)C(F)(F)F)[N+]([O-])=O