Reaction Details
TargetAndrogen receptor
LigandBDBM18682
Substrate/CompetitorBDBM26258
Meas. Tech.Competitive Radioligand Displacement Assay
pH7.4±n/a
Temperature277.15±n/a K
Ki 230±50 nM
Citation Kirkovsky, LMukherjee, AYin, DDalton, JTMiller, DD Chiral nonsteroidal affinity ligands for the androgen receptor. 1. Bicalutamide analogues bearing electrophilic groups in the B aromatic ring. J Med Chem43:581-90 (2000) 
 
Androgen receptor
Name:Androgen receptor
Type:Enzyme
Mol. Mass.:98219.08
Organism:Rattus norvegicus (Rat)
Description:P15207
Residue:902
BDBM18682
BDBM26258
NameBDBM18682
Synonyms:(2R)-N-[4-cyano-3-(trifluoromethyl)phenyl]-2-hydroxy-3-[(3-isothiocyanatophenyl)sulfanyl]-2-methylpropanamide | Bicalutamide Analogue, (R)-8
TypeSmall organic molecule
Emp. Form.C19H14F3N3O2S2
Mol. Mass.437.459
SMILESC[C@](O)(CSc1cccc(c1)N=C=S)C(=O)Nc1ccc(C#N)c(c1)C(F)(F)F