Reaction Details
TargetAndrogen receptor
LigandBDBM18684
Substrate/CompetitorBDBM26258
Meas. Tech.Competitive Radioligand Displacement Assay
pH7.4±n/a
Temperature277.15±n/a K
Ki 140±10 nM
Citation Kirkovsky, LMukherjee, AYin, DDalton, JTMiller, DD Chiral nonsteroidal affinity ligands for the androgen receptor. 1. Bicalutamide analogues bearing electrophilic groups in the B aromatic ring. J Med Chem43:581-90 (2000) 
 
Androgen receptor
Name:Androgen receptor
Type:Enzyme
Mol. Mass.:98219.08
Organism:Rattus norvegicus (Rat)
Description:P15207
Residue:902
BDBM18684
BDBM26258
NameBDBM18684
Synonyms:(2R)-N-[4-cyano-3-(trifluoromethyl)phenyl]-2-hydroxy-3-[(3-isothiocyanatobenzene)sulfonyl]-2-methylpropanamide | Bicalutamide Analogue, (R)-10
TypeSmall organic molecule
Emp. Form.C19H14F3N3O4S2
Mol. Mass.469.457
SMILESC[C@](O)(CS(=O)(=O)c1cccc(c1)N=C=S)C(=O)Nc1ccc(C#N)c(c1)C(F)(F)F