Reaction Details
TargetAndrogen receptor
LigandBDBM18697
Substrate/CompetitorBDBM26258
Meas. Tech.Competitive Radioligand Displacement Assay
pH7.4±n/a
Temperature277.15±n/a K
Ki 200±30 nM
Citation Kirkovsky, LMukherjee, AYin, DDalton, JTMiller, DD Chiral nonsteroidal affinity ligands for the androgen receptor. 1. Bicalutamide analogues bearing electrophilic groups in the B aromatic ring. J Med Chem43:581-90 (2000) 
 
Androgen receptor
Name:Androgen receptor
Type:Enzyme
Mol. Mass.:98219.08
Organism:Rattus norvegicus (Rat)
Description:P15207
Residue:902
BDBM18697
BDBM26258
NameBDBM18697
Synonyms:(2S)-3-{[4-(2-chloroacetamido)phenyl]sulfanyl}-N-[4-cyano-3-(trifluoromethyl)phenyl]-2-hydroxy-2-methylpropanamide | Bicalutamide Analogue, (S)-11
TypeSmall organic molecule
Emp. Form.C20H17ClF3N3O3S
Mol. Mass.471.88
SMILESC[C@@](O)(CSc1ccc(NC(=O)CCl)cc1)C(=O)Nc1ccc(C#N)c(c1)C(F)(F)F