Reaction Details
TargetAndrogen receptor
LigandBDBM18678
Substrate/CompetitorBDBM26258
Meas. Tech.Competitive Radioligand Displacement Assay and AR-Mediated Transcription Activation Assay
pH7.4±n/a
Temperature277.15±n/a K
Ki 11.0±1.5 nM
EC50 1000±n/a nM
CommentsMaximal percentage of transcriptional activation observed is 8.28 +/- 2.66%
Citation Dalton, JTMukherjee, AZhu, ZKirkovsky, LMiller, DD Discovery of nonsteroidal androgens. Biochem Biophys Res Commun244:1-4 (1998) 
 
Androgen receptor
Name:Androgen receptor
Type:Enzyme
Mol. Mass.:98219.08
Organism:Rattus norvegicus (Rat)
Description:P15207
Residue:902
BDBM18678
BDBM26258
NameBDBM18678
Synonyms:(2R)-N-[4-cyano-3-(trifluoromethyl)phenyl]-3-[(4-fluorobenzene)sulfonyl]-2-hydroxy-2-methylpropanamide CHEMBL63560 US11230523, Compound R-Bicalutamide US20230382870, (R) Bicalutumide
TypeSmall organic molecule
Emp. Form.C18H14F4N2O4S
Mol. Mass.430.373
SMILESC[C@](O)(CS(=O)(=O)c1ccc(F)cc1)C(=O)Nc1ccc(C#N)c(c1)C(F)(F)F