Reaction Details
TargetPlasma kallikrein
LigandBDBM359614
Substrate/Competitorn/a
Meas. Tech.Plasma kallikrein inhibitory activity
IC50 3.86±n/a nM
Citation Edwards, HJEvans, DMMeghani, PNovak, AR Inhibitors of plasma kallikrein US Patent US10221161 Publication Date 3/5/2019
 
Plasma kallikrein
Name:Plasma kallikrein
Type:Protein
Mol. Mass.:71391.16
Organism:Homo sapiens (Human)
Description:P03952
Residue:638
BDBM359614
NameBDBM359614
Synonyms:N-[(1-Aminoisoquinolin-6-yl)methyl]-({4-[(4-methylpyrazol-1-yl)methyl]phenyl}methyl)pyridine-3-carboxamide US11242333, Example 1
TypeSmall organic molecule
Emp. Form.C28H26N6O
Mol. Mass.462.5456
SMILESCc1cnn(Cc2ccc(Cc3cncc(c3)C(=O)NCc3ccc4c(N)nccc4c3)cc2)c1