Reaction Details
TargetThymidylate synthase
LigandBDBM18755
Substrate/CompetitorBDBM18754
Meas. Tech.Thymidylate Synthase (TS) Assay
pH7.4±n/a
Temperature293.15±n/a K
Ki 11000±n/a nM
Citation Costi, MPGelain, ABarlocco, DGhelli, SSoragni, FReniero, FRossi, TRuberto, AGuillou, CCavazzuti, ACasolari, CFerrari, S Antibacterial agent discovery using thymidylate synthase biolibrary screening. J Med Chem49:5958-68 (2006) 
 
Thymidylate synthase
Name:Thymidylate synthase
Type:Enzyme
Mol. Mass.:36576.54
Organism:Lactobacillus casei
Description:n/a
Residue:316
BDBM18755
BDBM18754
NameBDBM18755
Synonyms:1,2-naphthalein derivative, 1 | 3,3-bis(4-hydroxyphenyl)-4-oxatricyclo[7.4.0.0^{2,6}]trideca-1(9),2(6),7,10,12-pentaen-5-one
TypeSmall organic molecule
Emp. Form.C24H16O4
Mol. Mass.368.3814
SMILESOc1ccc(cc1)C1(OC(=O)c2ccc3ccccc3c12)c1ccc(O)cc1