Reaction Details
TargetThymidylate synthase
LigandBDBM18762
Substrate/CompetitorBDBM18754
Meas. Tech.Thymidylate Synthase (TS) Assay
pH7.4±n/a
Temperature293.15±n/a K
Ki 31000±n/a nM
Citation Costi, MPGelain, ABarlocco, DGhelli, SSoragni, FReniero, FRossi, TRuberto, AGuillou, CCavazzuti, ACasolari, CFerrari, S Antibacterial agent discovery using thymidylate synthase biolibrary screening. J Med Chem49:5958-68 (2006) 
 
Thymidylate synthase
Name:Thymidylate synthase
Type:Enzyme
Mol. Mass.:36576.54
Organism:Lactobacillus casei
Description:n/a
Residue:316
BDBM18762
BDBM18754
NameBDBM18762
Synonyms:1,8-naphthalein derivative, 9 | 4,4-bis(4-hydroxy-3-iodophenyl)-3-oxatricyclo[7.3.1.0^{5,13}]trideca-1(12),5,7,9(13),10-pentaen-2-one
TypeSmall organic molecule
Emp. Form.C24H14I2O4
Mol. Mass.620.1745
SMILESOc1ccc(cc1I)C1(OC(=O)c2cccc3cccc1c23)c1ccc(O)c(I)c1