Reaction Details
TargetThymidylate synthase
LigandBDBM18758
Substrate/CompetitorBDBM18754
Meas. Tech.Thymidylate Synthase (TS) Assay
Ki 2700±n/a nM
Citation Costi, MPGelain, ABarlocco, DGhelli, SSoragni, FReniero, FRossi, TRuberto, AGuillou, CCavazzuti, ACasolari, CFerrari, S Antibacterial agent discovery using thymidylate synthase biolibrary screening. J Med Chem49:5958-68 (2006) 
 
Thymidylate synthase
Name:Thymidylate synthase
Type:Enzyme
Mol. Mass.:35863.57
Organism:Cryptococcus neoformans
Description:n/a
Residue:317
BDBM18758
BDBM18754
NameBDBM18758
Synonyms:1,2-naphthalein derivative, 4 Phenolnaphthalein derivative, 4
TypeSmall organic molecule
Emp. Form.C24H14Br2O4
Mol. Mass.526.174
SMILESOc1ccc(cc1Br)C1(OC(=O)c2ccc3ccccc3c12)c1ccc(O)c(Br)c1