Reaction Details
TargetThymidylate synthase
LigandBDBM18759
Substrate/CompetitorBDBM18754
Meas. Tech.Thymidylate Synthase (TS) Assay
Ki 13000±n/a nM
Citation Costi, MPGelain, ABarlocco, DGhelli, SSoragni, FReniero, FRossi, TRuberto, AGuillou, CCavazzuti, ACasolari, CFerrari, S Antibacterial agent discovery using thymidylate synthase biolibrary screening. J Med Chem49:5958-68 (2006) 
 
Thymidylate synthase
Name:Thymidylate synthase
Type:Enzyme
Mol. Mass.:35863.57
Organism:Cryptococcus neoformans
Description:n/a
Residue:317
BDBM18759
BDBM18754
NameBDBM18759
Synonyms:1,2-naphthalein derivative, 5 Phenolnaphthalein derivative, 5
TypeSmall organic molecule
Emp. Form.C24H12Br4O4
Mol. Mass.683.966
SMILESOc1c(Br)cc(cc1Br)C1(OC(=O)c2ccc3ccccc3c12)c1cc(Br)c(O)c(Br)c1