Reaction Details
TargetThymidylate synthase
LigandBDBM18772
Substrate/CompetitorBDBM18754
Meas. Tech.Thymidylate Synthase (TS) Assay
Ki 4100±n/a nM
Citation Costi, MPGelain, ABarlocco, DGhelli, SSoragni, FReniero, FRossi, TRuberto, AGuillou, CCavazzuti, ACasolari, CFerrari, S Antibacterial agent discovery using thymidylate synthase biolibrary screening. J Med Chem49:5958-68 (2006) 
 
Thymidylate synthase
Name:Thymidylate synthase
Type:Enzyme
Mol. Mass.:35863.57
Organism:Cryptococcus neoformans
Description:n/a
Residue:317
BDBM18772
BDBM18754
NameBDBM18772
Synonyms:1,8-naphthalein derivative, 16 Phenolnaphthalein derivative, 2
TypeSmall organic molecule
Emp. Form.C24H13Br2ClO4
Mol. Mass.560.619
SMILESOc1ccc(cc1Br)C1(OC(=O)c2cccc3c(Cl)ccc1c23)c1ccc(O)c(Br)c1