Reaction Details
TargetDihydrofolate reductase
LigandBDBM18763
Substrate/CompetitorBDBM18044
Meas. Tech.Thymidylate Synthase (TS) Assay
Ki 5200±n/a nM
Citation Costi, MPGelain, ABarlocco, DGhelli, SSoragni, FReniero, FRossi, TRuberto, AGuillou, CCavazzuti, ACasolari, CFerrari, S Antibacterial agent discovery using thymidylate synthase biolibrary screening. J Med Chem49:5958-68 (2006) 
 
Dihydrofolate reductase
Name:Dihydrofolate reductase
Type:Enzyme
Mol. Mass.:21453.99
Organism:Homo sapiens (Human)
Description:Recombinant human DHFR.
Residue:187
BDBM18763
BDBM18044
NameBDBM18763
Synonyms:1,8-naphthalein derivative, 10 A15 Alpha 156 | CHEMBL67116
TypeSmall organic molecule
Emp. Form.C24H14Cl2O4
Mol. Mass.437.272
SMILESOc1ccc(cc1Cl)C1(OC(=O)c2cccc3cccc1c23)c1ccc(O)c(Cl)c1