Reaction Details
TargetDihydrofolate reductase
LigandBDBM18769
Substrate/CompetitorBDBM18044
Meas. Tech.Thymidylate Synthase (TS) Assay
Ki 42000±n/a nM
Citation Costi, MPGelain, ABarlocco, DGhelli, SSoragni, FReniero, FRossi, TRuberto, AGuillou, CCavazzuti, ACasolari, CFerrari, S Antibacterial agent discovery using thymidylate synthase biolibrary screening. J Med Chem49:5958-68 (2006) 
 
Dihydrofolate reductase
Name:Dihydrofolate reductase
Type:Enzyme
Mol. Mass.:21453.99
Organism:Homo sapiens (Human)
Description:Recombinant human DHFR.
Residue:187
BDBM18769
BDBM18044
NameBDBM18769
Synonyms:1,8-naphthalein derivative, 17 CHEMBL303171 | Phenolnaphthalein derivative, 1
TypeSmall organic molecule
Emp. Form.C24H14F2O4
Mol. Mass.404.3624
SMILESOc1ccc(cc1F)C1(OC(=O)c2cccc3cccc1c23)c1ccc(O)c(F)c1