Reaction Details
TargetFatty-acid amide hydrolase 1
LigandBDBM359721
Substrate/Competitorn/a
Meas. Tech.Fluorescent Assay
IC50 0.840±n/a nM
Citation Piomelli, DBandiera, TScarpelli, R Inhibitors of fatty acid amide hydrolase (FAAH) enzyme with improved oral bioavailability and their use as medicaments US Patent US9822068 Publication Date 11/21/2017
 
Fatty-acid amide hydrolase 1
Name:Fatty-acid amide hydrolase 1
Type:Protein
Mol. Mass.:63071.19
Organism:Homo sapiens (Human)
Description:O00519
Residue:579
BDBM359721
NameBDBM359721
Synonyms:US10435355, Example 5 [3-(3-carbamoylphenyl)-4- fluoro-phenyl]N- cyclopentylcarbamate
TypeSmall organic molecule
Emp. Form.C19H19FN2O3
Mol. Mass.342.3642
SMILESNC(=O)c1cccc(c1)-c1cc(OC(=O)NC2CCCC2)ccc1F