Reaction Details
TargetFatty-acid amide hydrolase 1 [30-579]
LigandBDBM359728
Substrate/Competitorn/a
Meas. Tech.Radiometric Assay
IC50 0.230±n/a nM
Citation Piomelli, DBandiera, TScarpelli, R Inhibitors of fatty acid amide hydrolase (FAAH) enzyme with improved oral bioavailability and their use as medicaments US Patent US9822068 Publication Date 11/21/2017
 
Fatty-acid amide hydrolase 1 [30-579]
Name:Fatty-acid amide hydrolase 1 [30-579]
Type:Single-pass membrane protein; homodimer
Mol. Mass.:60474.00
Organism:Rattus norvegicus (rat)
Description:P97612 (aa 30-579)
Residue:550
BDBM359728
NameBDBM359728
Synonyms:US10435355, Example 12 [3-(3-carbamoylphenyl)-5- fluoro-phenyl]N- cyclohexylcarbamate
TypeSmall organic molecule
Emp. Form.C20H21FN2O3
Mol. Mass.356.3907
SMILESNC(=O)c1cccc(c1)-c1cc(F)cc(OC(=O)NC2CCCCC2)c1