Reaction Details
TargetBifunctional dihydrofolate reductase-thymidylate synthase
LigandBDBM18792
Substrate/CompetitorBDBM18044
Meas. Tech.Antimalarial Testing In Vitro (IC50) and Measurement of Inhibition Constant (Ki)
pH7±n/a
Temperature298.15±n/a K
Ki 6.2±0.4 nM
IC50 2400±1100 nM
Citation Yuvaniyama, JChitnumsub, PKamchonwongpaisan, SVanichtanankul, JSirawaraporn, WTaylor, PWalkinshaw, MDYuthavong, Y Insights into antifolate resistance from malarial DHFR-TS structures. Nat Struct Biol10:257-65 (2003) 
 
Bifunctional dihydrofolate reductase-thymidylate synthase
Name:Bifunctional dihydrofolate reductase-thymidylate synthase
Type:Enzyme
Mol. Mass.:71822.51
Organism:Plasmodium falciparum (isolate K1 / Thailand)
Description:The mutant clone was prepared by cassette mutagenesis using wildtype pfDHFR as a template, and expressed in E. coli.
Residue:608
BDBM18792
BDBM18044
NameBDBM18792
Synonyms:1-(4-chlorophenyl)-6,6-dimethyl-1,6-dihydro-1,3,5-triazine-2,4-diamine Chlorazin | Cycloguanil
TypeSmall organic molecule
Emp. Form.C11H14ClN5
Mol. Mass.251.715
SMILESCC1(C)N=C(N)N=C(N)N1c1ccc(Cl)cc1