Reaction Details
TargetThyroid hormone receptor beta
LigandBDBM18860
Substrate/CompetitorBDBM18860
Meas. Tech.TRalpha-Binding Assay.
IC50 0.26±n/a nM
Citation Hangeland, JJDoweyko, AMDejneka, TFriends, TJDevasthale, PMellström, KSandberg, JGrynfarb, MSack, JSEinspahr, HFärnegård, MHusman, BLjunggren, JKoehler, KSheppard, CMalm, JRyono, DE Thyroid receptor ligands. Part 2: Thyromimetics with improved selectivity for the thyroid hormone receptor beta. Bioorg Med Chem Lett14:3549-53 (2004) 
 
Thyroid hormone receptor beta
Name:Thyroid hormone receptor beta
Type:Receptor
Mol. Mass.:52793.62
Organism:Homo sapiens (Human)
Description:Recombinant hThR was obtained from nuclear extracts from SF9 cells infected with baculovirus vectors encoding for ThRbeta 1.
Residue:461
BDBM18860
BDBM18860
NameBDBM18860
Synonyms:(2R)-2-amino-3-[4-(4-hydroxy-3-iodophenoxy)-3,5-diiodophenyl]propanoic acid 3,5,3'-triiodo-L-thyronine (T3) Triiodothyronine US10544075, Compound T3 liothyronine | triothyrone
TypeHormone
Emp. Form.C15H12I3NO4
Mol. Mass.650.9735
SMILESN[C@@H](Cc1cc(I)c(Oc2ccc(O)c(I)c2)c(I)c1)C(O)=O