Reaction Details
TargetOrexin/Hypocretin receptor type 1
LigandBDBM360351
Substrate/Competitorn/a
IC50 21.0±n/a nM
Citation Liverton, NBeshore, DCKuduk, SDLuo, YMeng, NYu, T Oxazole orexin receptor antagonists US Patent US9828368 Publication Date 11/28/2017
 
Orexin/Hypocretin receptor type 1
Name:Orexin/Hypocretin receptor type 1
Type:Protein
Mol. Mass.:46817.55
Organism:Rattus norvegicus (Rat)
Description:P56718
Residue:416
BDBM360351
NameBDBM360351
Synonyms:US9828368, Example 13 US9828368, Example 15
TypeSmall organic molecule
Emp. Form.C20H20BrN5O4
Mol. Mass.474.308
SMILESCOC(=O)c1nc(oc1Br)[C@@H]1CC[C@@H](C)N(C1)C(=O)c1ccccc1-n1nccn1