Reaction Details
TargetThyroid hormone receptor alpha
LigandBDBM18883
Substrate/CompetitorBDBM18860
Meas. Tech.TRalpha-Binding Assay.
pH7±n/a
Temperature277.15±n/a K
IC50 1600±n/a nM
Citation Koehler, KGordon, SBrandt, PCarlsson, BBäcksbro-Saeidi, AApelqvist, TAgback, PGrover, GJNelson, WGrynfarb, MFärnegård, MRehnmark, SMalm, J Thyroid receptor ligands. 6. A high affinity "direct antagonist" selective for the thyroid hormone receptor. J Med Chem49:6635-7 (2006) 
 
Thyroid hormone receptor alpha
Name:Thyroid hormone receptor alpha
Type:Receptor
Mol. Mass.:54818.00
Organism:Homo sapiens (Human)
Description:Recombinant hThR was obtained from nuclear extracts from SF9 cells infected with baculovirus vectors encoding for ThRalpha 1.
Residue:490
BDBM18883
BDBM18860
NameBDBM18883
Synonyms:3,5-dibromo-4-[4-hydroxy-3,5-bis(propan-2-yl)phenoxy]benzoic acid thyromimetic, 4
TypeSmall organic molecule
Emp. Form.C19H20Br2O4
Mol. Mass.472.168
SMILESCC(C)c1cc(Oc2c(Br)cc(cc2Br)C(O)=O)cc(C(C)C)c1O