Reaction Details
TargetAmine oxidase [flavin-containing] B
LigandBDBM19188
Substrate/CompetitorBDBM10999
Meas. Tech.MAO B Activity Measurement
pH7.5±n/a
Temperature298.15±n/a K
Ki 100±20 nM
Citation Binda, CWang, JPisani, LCaccia, CCarotti, ASalvati, PEdmondson, DEMattevi, A Structures of Human Monoamine Oxidase B Complexes with Selective Noncovalent Inhibitors: Safinamide and Coumarin Analogs. J Med Chem50:5848-5852 (2007) 
 
Amine oxidase [flavin-containing] B
Name:Amine oxidase [flavin-containing] B
Type:Protein
Mol. Mass.:58768.76
Organism:Homo sapiens (Human)
Description:P27338
Residue:520
BDBM19188
BDBM10999
NameBDBM19188
Synonyms:7-(3-chlorobenzyloxy)-4-(methylamino)methyl-coumarin, 2 C18 | CHEMBL593763
TypeSmall organic molecule
Emp. Form.C18H16ClNO3
Mol. Mass.329.778
SMILESCNCc1cc(=O)oc2cc(OCc3cccc(Cl)c3)ccc12