Reaction Details
TargetHistone deacetylase 1
LigandBDBM19415
Substrate/CompetitorBDBM19411
Meas. Tech.HDAC Enzyme Activity Assay
pH8±n/a
Temperature310.15±n/a K
IC50 60±n/a nM
Citation Moradei, OMMallais, TCFrechette, SPaquin, ITessier, PELeit, SMFournel, MBonfils, CTrachy-Bourget, MCLiu, JYan, TPLu, AHRahil, JWang, JLefebvre, SLi, ZVaisburg, AFBesterman, JM Novel aminophenyl benzamide-type histone deacetylase inhibitors with enhanced potency and selectivity. J Med Chem50:5543-6 (2007) 
 
Histone deacetylase 1
Name:Histone deacetylase 1
Type:Enzyme
Mol. Mass.:55090.27
Organism:Homo sapiens (Human)
Description:Q13547
Residue:482
BDBM19415
BDBM19411
NameBDBM19415
Synonyms:N-(2-amino-5-phenylphenyl)-4-{[(3,4-dimethoxyphenyl)amino]methyl}benzamide | benzamide-type inhibitor, 11
TypeSmall organic molecule
Emp. Form.C28H27N3O3
Mol. Mass.453.5323
SMILESCOc1ccc(NCc2ccc(cc2)C(=O)Nc2cc(ccc2N)-c2ccccc2)cc1OC