Reaction Details
TargetHistone deacetylase 1
LigandBDBM19422
Substrate/CompetitorBDBM19411
Meas. Tech.HDAC Enzyme Activity Assay
IC50 900±n/a nM
Citation Moradei, OMMallais, TCFrechette, SPaquin, ITessier, PELeit, SMFournel, MBonfils, CTrachy-Bourget, MCLiu, JYan, TPLu, AHRahil, JWang, JLefebvre, SLi, ZVaisburg, AFBesterman, JM Novel aminophenyl benzamide-type histone deacetylase inhibitors with enhanced potency and selectivity. J Med Chem50:5543-6 (2007) 
 
Histone deacetylase 1
Name:Histone deacetylase 1
Type:Enzyme
Mol. Mass.:55090.27
Organism:Homo sapiens (Human)
Description:Q13547
Residue:482
BDBM19422
BDBM19411
NameBDBM19422
Synonyms:4-(acetylamino)-N-(2-amino-phenyl) benzamide N-(2-aminophenyl)-4-acetamidobenzamide US11207431, Example F | US11377423, CI-994
TypeSmall organic molecule
Emp. Form.C15H15N3O2
Mol. Mass.269.2985
SMILESCC(=O)Nc1ccc(cc1)C(=O)Nc1ccccc1N