Reaction Details
TargetCathepsin S
LigandBDBM19496
Substrate/CompetitorBDBM19490
Meas. Tech.Enzyme Inhibition Assay
pH6.5±n/a
Temperature295.15±n/a K
IC50 1.8±n/a nM
Citation Gauthier, JYBlack, WCCourchesne, ICromlish, WDesmarais, SHoule, RLamontagne, SLi, CSMassé, FMcKay, DJOuellet, MRobichaud, JTruchon, JFTruong, VLWang, QPercival, MD The identification of potent, selective, and bioavailable cathepsin S inhibitors. Bioorg Med Chem Lett17:4929-33 (2007) 
 
Cathepsin S
Name:Cathepsin S
Type:Protein
Mol. Mass.:37507.38
Organism:Homo sapiens (Human)
Description:P25774
Residue:331
BDBM19496
BDBM19490
NameBDBM19496
Synonyms:(2R)-N-(1-cyanocyclopropyl)-3-methanesulfonyl-2-{[(1S)-2,2,2-trifluoro-1-(4-fluorophenyl)ethyl]amino}propanamide | trifluoroethylamine inhibitor, 6
TypeSmall organic molecule
Emp. Form.C16H17F4N3O3S
Mol. Mass.407.383
SMILESCS(=O)(=O)C[C@H](N[C@@H](c1ccc(F)cc1)C(F)(F)F)C(=O)NC1(CC1)C#N