Reaction Details
TargetPlasma kallikrein
LigandBDBM187100
Substrate/Competitorn/a
Meas. Tech.Inhibition Assay
IC50 0.600±n/a nM
Citation Allan, CEBatt, ARDavie, RLEdwards, HJEvans, DMPethen, SJ Benzylamine derivatives US Patent US9834513 Publication Date 12/5/2017
 
Plasma kallikrein
Name:Plasma kallikrein
Type:Protein
Mol. Mass.:71391.16
Organism:Homo sapiens (Human)
Description:P03952
Residue:638
BDBM187100
NameBDBM187100
Synonyms:US9670157, 114 3-Methyl-1-[4-(4-methyl-pyrazol-1-ylmethyl)-benzyl]-1H-pyrazole-4-carboxylic acid 4-aminomethyl-2,6-dimethyl-benzylamide | US9834513, 114
TypeSmall organic molecule
Emp. Form.C27H32N6O
Mol. Mass.456.5826
SMILESCc1cnn(Cc2ccc(Cn3cc(C(=O)NCc4c(C)cc(CN)cc4C)c(C)n3)cc2)c1