Reaction Details
TargetPlasma kallikrein
LigandBDBM187104
Substrate/Competitorn/a
Meas. Tech.Inhibition Assay
IC50 1.000±n/a nM
Citation Allan, CEBatt, ARDavie, RLEdwards, HJEvans, DMPethen, SJ Benzylamine derivatives US Patent US9834513 Publication Date 12/5/2017
 
Plasma kallikrein
Name:Plasma kallikrein
Type:Protein
Mol. Mass.:71391.16
Organism:Homo sapiens (Human)
Description:P03952
Residue:638
BDBM187104
NameBDBM187104
Synonyms:US9670157, 118 1-[4-(4-Methyl-pyrazol-1-ylmethyl)-benzyl]-3-trifluoromethyl-1H-pyrazole-4-carboxylic acid 4-aminomethyl-2,6-dimethyl-benzylamide | US9834513, 118
TypeSmall organic molecule
Emp. Form.C27H29F3N6O
Mol. Mass.510.554
SMILESCc1cnn(Cc2ccc(Cn3cc(C(=O)NCc4c(C)cc(CN)cc4C)c(n3)C(F)(F)F)cc2)c1