Reaction Details
TargetCathepsin S
LigandBDBM19626
Substrate/CompetitorBDBM19546
Meas. Tech.Enzyme Inhibition Assay
pH5.5±n/a
Temperature310.15±n/a K
Ki 15±n/a nM
Citation Tully, DCLiu, HAlper, PBChatterjee, AKEpple, RRoberts, MJWilliams, JANguyen, KTWoodmansee, DHTumanut, CLi, JSpraggon, GChang, JTuntland, THarris, JLKaranewsky, DS Synthesis and evaluation of arylaminoethyl amides as noncovalent inhibitors of cathepsin S. Part 3: heterocyclic P3. Bioorg Med Chem Lett16:1975-80 (2006) 
 
Cathepsin S
Name:Cathepsin S
Type:Protein
Mol. Mass.:37507.38
Organism:Homo sapiens (Human)
Description:P25774
Residue:331
BDBM19626
BDBM19546
NameBDBM19626
Synonyms:(2S)-2-[(7-chloro-1,3-benzoxazol-2-yl)amino]-3-cyclohexyl-N-[(2S)-1-(5-fluoro-2,2-dimethyl-2,3-dihydro-1H-indol-1-yl)propan-2-yl]propanamide | Heterocyclic arylaminoethyl amide, 12e
TypeSmall organic molecule
Emp. Form.C29H36ClFN4O2
Mol. Mass.527.073
SMILESC[C@@H](CN1c2ccc(F)cc2CC1(C)C)NC(=O)[C@H](CC1CCCCC1)Nc1nc2cccc(Cl)c2o1