Reaction Details
TargetTyrosine-protein kinase SYK
LigandBDBM243355
Substrate/Competitorn/a
Meas. Tech.In Vitro SYK Inhibition Assay
pH7.8±n/a
Temperature298.15±n/a K
IC50<500±n/a nM
Commentsextracted
Citation Benjahad, AMartin, JSchalon, CPez, DChevenier, ESandrinelli, FPicoul, WMoussy, A Diazaspiroalkaneone-substituted oxazole derivatives as spleen tyrosine kinase inhibitors US Patent US10053455 Publication Date 8/21/2018
 
Tyrosine-protein kinase SYK
Name:Tyrosine-protein kinase SYK
Type:Enzyme
Mol. Mass.:72079.99
Organism:Homo sapiens (Human)
Description:P43405
Residue:635
BDBM243355
NameBDBM243355
Synonyms:5-{5-[3-(4-Isopropyl- pyrimidin-2-ylamino)- phenyl]-oxazol-2-yl}-5,8- diaza-spiro[3.5]non-9- one | US10053455, 011
TypeSmall organic molecule
Emp. Form.C23H26N6O2
Mol. Mass.418.4915
SMILESCC(C)c1ccnc(Nc2cccc(c2)-c2cnc(o2)N2CCNC(=O)C22CCC2)n1