Reaction Details
TargetTyrosine-protein kinase SYK
LigandBDBM243363
Substrate/Competitorn/a
Meas. Tech.In Vitro SYK Inhibition Assay
pH7.8±n/a
Temperature298.15±n/a K
IC50<500±n/a nM
Commentsextracted
Citation Benjahad, AMartin, JSchalon, CPez, DChevenier, ESandrinelli, FPicoul, WMoussy, A Diazaspiroalkaneone-substituted oxazole derivatives as spleen tyrosine kinase inhibitors US Patent US10053455 Publication Date 8/21/2018
 
Tyrosine-protein kinase SYK
Name:Tyrosine-protein kinase SYK
Type:Enzyme
Mol. Mass.:72079.99
Organism:Homo sapiens (Human)
Description:P43405
Residue:635
BDBM243363
NameBDBM243363
Synonyms:4-{5-[3-(4-Pyridin-3-yl- pyrimidin-2-ylamino)- phenyl]-oxazol-2-yl}-4,7- diaza-spiro[2.5]octan-8- one | US10053455, 019
TypeSmall organic molecule
Emp. Form.C25H24N7O2
Mol. Mass.454.5038
SMILESC[N]1=C(OC(=C1)c1cccc(Nc2nccc(n2)-c2cccnc2)c1)N1CCNC(=O)C11CC1